{"text_format":"1","workbook":"xlsx","n_sheets":5,"sheets":["Instructions","1. Data Sheet","2. Performance Dashboard","3. Term Sheet","Calculations"],"not_rendered":{"charts":11,"images":1,"macros":1,"external_links":0,"defined_names":1,"comments":0,"pivot_tables":0},"unopened":[],"bounds":{"document_bytes":16777216,"sheet_cells":100000,"rows_first":2000,"rows_last":500,"rows_between":2000,"halvings":0,"cell_chars":16384,"cell_head_chars":4096},"cells_cut":0,"cells_raw":0,"read":"whole","date_system":"1900"}

{"sheet":"Instructions","index":0,"n_rows":18,"n_cols":3,"rows_kept":18,"cut":false,"hidden":false,"merged":[[28,2,30,4],[17,1,17,2],[1,1,1,2],[6,1,8,1],[10,1,10,2],[22,1,22,2],[24,2,26,4],[24,1,26,1]]}
[]
[null,"Performance Management Dashboard"]
[]
[]
[null,"About this resource","The purpose of this resource is to provide HR professionals with a high-level overview of key performance metrics to drive critical decisions and discussions with the business at the end of the performance cycle."]
[]
[null,"Included in this resource","1. Data Sheet: Use this sheet to enter information about your employees and their performance ratings."]
[null,null,"2. Performance Dashboard: Use this sheet to review a visual representation of data spanning various business units and demographic categories."]
[null,null,"3. Term Sheet: This sheet allows you to update the fields to customize drop-down menus and make them relevant to your own organization."]
[]
[null," Instructions"]
[null,"STEP 1","Create a copy of this document."]
[null,"STEP 2","Go to the Term Sheet and replace the terms with those relevant to your organization. Ensure that you only replace terms in the blue-outlined cells. "]
[null,"STEP 3","Use the Data Sheet to input your data. Use the set drop-downs where applicable. "]
[null,"STEP 4","You can use the dashboard to visualize both individual and manager ratings across business units and based on demographic information."]
[]
[]
[null,"ATTENTION\nUsing this template means filling it with sensitive, personal information about the employees at your organization. It's important to ensure that this information is kept confidential and protected. \nDon't share this information beyond the relevant and accredited stakeholders."]

{"sheet":"1. Data Sheet","index":1,"n_rows":8,"n_cols":14,"rows_kept":8,"cut":false,"hidden":false,"merged":[[1,1,1,5],[1,7,1,11]]}
[null,"Data Sheet"]
[null,null,null,null,null,null,"Review period:"]
[null,"Employee full name","Business unit","Age","Demographic","Gender","Tenure","Final rating for\nprevious period","Individual rating for\ncurrent period","Manager","Manager rating for\ncurrent period","Final rating for\ncurrent period"]
[null,"Enter the employee's name and surname.","Choose the employee's business unit.","Choose the employee's age range.","Choose the employee's demographic profile.","Choose the employee's gender.","Enter the employee's tenure in years.","Enter the employee's final rating for previous period.","Enter the employee's individual rating for the current period.","Choose the manager.","Enter the manager's rating for the current period.","Enter the final rating for the current period.",null,"Rating legend:"]
[null,"Filter by name","Filter by business unit","Filter by age rage","Filter by demographic profile","Filter by gender","Filter by tenure","Filter by rating","Filter by rating","Filter by manager","Filter by rating","Filter by rating",null,"1. Insufficient"]
[null,null,null,null,null,null,null,null,null,null,null,null,null,"2. Moderate"]
[null,null,null,null,null,null,null,null,null,null,null,null,null,"3. Sufficient"]
[null,null,null,null,null,null,null,null,null,null,null,null,null,"4. Exceeding"]

{"sheet":"2. Performance Dashboard","index":2,"n_rows":117,"n_cols":9,"rows_kept":117,"cut":false,"hidden":false,"merged":[[104,2,111,6],[116,2,123,6],[104,8,111,12],[116,8,123,12],[80,2,87,6],[80,8,87,12],[92,8,99,12],[92,2,99,6]]}
[null,null,"Performance Dashboard"]
[]
[]
[]
[]
[]
[]
[]
[]
[]
[]
[]
[]
[]
[]
[]
[]
[]
[]
[]
[]
[]
[]
[]
[]
[]
[]
[]
[]
[]
[]
[]
[]
[]
[]
[]
[]
[]
[]
[]
{"$rows_left_out":78}
{"sheet":"3. Term Sheet","index":3,"n_rows":18,"n_cols":6,"rows_kept":18,"cut":false,"hidden":false,"merged":[[225,1,225,4],[1,0,1,5],[2,0,2,5]]}
["Manager","Business unit","Age","Demographic","Gender","Score"]
["You will find some suggested terms here, but you can update all the fields within a cell with a blue border to reflect the data relevant to your own organization. "]
["ATTENTION: If you make changes to the data sheet after you have started adding information to it, the drop-down lists will update automatically, but the data you’ve previously entered will remain unchanged. \nThat means you will need to go back to the data sheet and manually replace the old term with the new one."]
["Manager 1","BU 1","18–24","Asian","Woman",1]
["Manager 2","BU 2","25–34","Black","Man",2]
["Manager 3","BU 3","35–44","Hispanic or Latino","Nonbinary",3]
["Manager 4","BU 4","45–54","White","Other",4]
["Manager 5","BU 5","55–64","American Indian/Alaska Native","Prefers not to disclose"]
["Manager 6","BU 6","65+","Prefers not to identify"]
["Manager 7","BU 7"]
["Manager 8","BU 8"]
["Manager 9","BU 9"]
["Manager 10","BU 10"]
["Manager 11","BU 11"]
["Manager 12","BU 12"]
["Manager 13","BU 13"]
["Manager 14","BU 14"]
["Manager 15","BU 15"]

{"sheet":"Calculations","index":4,"n_rows":173,"n_cols":16,"rows_kept":173,"cut":false,"hidden":true,"merged":[[121,0,121,15],[96,0,96,15],[72,0,72,15],[49,0,49,15],[7,0,7,5],[20,0,20,6],[34,0,34,6],[7,7,7,12],[20,8,20,14],[34,8,34,14]]}
["Score",{"$f":"'1. Data Sheet'!I3","v":"Individual rating for\ncurrent period"},{"$f":"'1. Data Sheet'!K3","v":"Manager rating for\ncurrent period"},{"$f":"'1. Data Sheet'!H3","v":"Final rating for\nprevious period"}]
[{"$f":"'3. Term Sheet'!F4","v":1},{"$f":"COUNTIF('1. Data Sheet'!$I$6:$I$506,A2)","v":0},{"$f":"COUNTIF('1. Data Sheet'!$K$6:$K$506,A2)","v":0},{"$f":"COUNTIF('1. Data Sheet'!$H$6:$H$506,A2)","v":0}]
[{"$f":"'3. Term Sheet'!F5","v":2},{"$f":"COUNTIF('1. Data Sheet'!$I$6:$I$506,A3)","v":0},{"$f":"COUNTIF('1. Data Sheet'!$K$6:$K$506,A3)","v":0},{"$f":"COUNTIF('1. Data Sheet'!$H$6:$H$506,A3)","v":0}]
[{"$f":"'3. Term Sheet'!F6","v":3},{"$f":"COUNTIF('1. Data Sheet'!$I$6:$I$506,A4)","v":0},{"$f":"COUNTIF('1. Data Sheet'!$K$6:$K$506,A4)","v":0},{"$f":"COUNTIF('1. Data Sheet'!$H$6:$H$506,A4)","v":0}]
[{"$f":"'3. Term Sheet'!F7","v":4},{"$f":"COUNTIF('1. Data Sheet'!$I$6:$I$506,A5)","v":0},{"$f":"COUNTIF('1. Data Sheet'!$K$6:$K$506,A5)","v":0},{"$f":"COUNTIF('1. Data Sheet'!$H$6:$H$506,A5)","v":0}]
[]
[]
["Total Gender Profile Per Current Individual Score",null,null,null,null,null,null,"Total Gender Profile per Current Manager Score"]
[null,{"$f":"'3. Term Sheet'!E4","v":"Woman"},{"$f":"'3. Term Sheet'!E5","v":"Man"},{"$f":"'3. Term Sheet'!E6","v":"Nonbinary"},{"$f":"'3. Term Sheet'!E7","v":"Other"},{"$f":"'3. Term Sheet'!E8","v":"Prefers not to disclose"},null,null,{"$f":"'3. Term Sheet'!E4","v":"Woman"},{"$f":"'3. Term Sheet'!E5","v":"Man"},{"$f":"'3. Term Sheet'!E6","v":"Nonbinary"},{"$f":"'3. Term Sheet'!E7","v":"Other"},{"$f":"'3. Term Sheet'!E8","v":"Prefers not to disclose"}]
[{"$f":"A2","v":1},{"$f":"COUNTIFS('1. Data Sheet'!$F$6:$F$506,'3. Term Sheet'!$E$4,'1. Data Sheet'!$I$6:$I$506,A2)","v":0},{"$f":"COUNTIFS('1. Data Sheet'!$F$6:$F$506,'3. Term Sheet'!$E$5,'1. Data Sheet'!$I$6:$I$506,A2)","v":0},{"$f":"COUNTIFS('1. Data Sheet'!$F$6:$F$506,'3. Term Sheet'!$E$6,'1. Data Sheet'!$I$6:$I$506,A2)","v":0},{"$f":"COUNTIFS('1. Data Sheet'!$F$6:$F$506,'3. Term Sheet'!$E$7,'1. Data Sheet'!$I$6:$I$506,A2)","v":0},{"$f":"COUNTIFS('1. Data Sheet'!$F$6:$F$506,'3. Term Sheet'!$E$8,'1. Data Sheet'!$I$6:$I$506,A2)","v":0},null,{"$f":"A2","v":1},{"$f":"COUNTIFS('1. Data Sheet'!$F$6:$F$506,'3. Term Sheet'!$E$4,'1. Data Sheet'!$K$6:$K$506,A2)","v":0},{"$f":"COUNTIFS('1. Data Sheet'!$F$6:$F$506,'3. Term Sheet'!$E$5,'1. Data Sheet'!$K$6:$K$506,A2)","v":0},{"$f":"COUNTIFS('1. Data Sheet'!$F$6:$F$506,'3. Term Sheet'!$E$6,'1. Data Sheet'!$K$6:$K$506,A2)","v":0},{"$f":"COUNTIFS('1. Data Sheet'!$F$6:$F$506,'3. Term Sheet'!$E$7,'1. Data Sheet'!$K$6:$K$506,A2)","v":0},{"$f":"COUNTIFS('1. Data Sheet'!$F$6:$F$506,'3. Term Sheet'!$E$8,'1. Data Sheet'!$K$6:$K$506,A2)","v":0}]
[{"$f":"A3","v":2},{"$f":"COUNTIFS('1. Data Sheet'!$F$6:$F$506,'3. Term Sheet'!$E$4,'1. Data Sheet'!$I$6:$I$506,A3)","v":0},{"$f":"COUNTIFS('1. Data Sheet'!$F$6:$F$506,'3. Term Sheet'!$E$5,'1. Data Sheet'!$I$6:$I$506,A3)","v":0},{"$f":"COUNTIFS('1. Data Sheet'!$F$6:$F$506,'3. Term Sheet'!$E$6,'1. Data Sheet'!$I$6:$I$506,A3)","v":0},{"$f":"COUNTIFS('1. Data Sheet'!$F$6:$F$506,'3. Term Sheet'!$E$7,'1. Data Sheet'!$I$6:$I$506,A3)","v":0},{"$f":"COUNTIFS('1. Data Sheet'!$F$6:$F$506,'3. Term Sheet'!$E$8,'1. Data Sheet'!$I$6:$I$506,A3)","v":0},null,{"$f":"A3","v":2},{"$f":"COUNTIFS('1. Data Sheet'!$F$6:$F$506,'3. Term Sheet'!$E$4,'1. Data Sheet'!$K$6:$K$506,A3)","v":0},{"$f":"COUNTIFS('1. Data Sheet'!$F$6:$F$506,'3. Term Sheet'!$E$5,'1. Data Sheet'!$K$6:$K$506,A3)","v":0},{"$f":"COUNTIFS('1. Data Sheet'!$F$6:$F$506,'3. Term Sheet'!$E$6,'1. Data Sheet'!$K$6:$K$506,A3)","v":0},{"$f":"COUNTIFS('1. Data Sheet'!$F$6:$F$506,'3. Term Sheet'!$E$7,'1. Data Sheet'!$K$6:$K$506,A3)","v":0},{"$f":"COUNTIFS('1. Data Sheet'!$F$6:$F$506,'3. Term Sheet'!$E$8,'1. Data Sheet'!$K$6:$K$506,A3)","v":0}]
[3,{"$f":"COUNTIFS('1. Data Sheet'!$F$6:$F$506,'3. Term Sheet'!$E$4,'1. Data Sheet'!$I$6:$I$506,A4)","v":0},{"$f":"COUNTIFS('1. Data Sheet'!$F$6:$F$506,'3. Term Sheet'!$E$5,'1. Data Sheet'!$I$6:$I$506,A4)","v":0},{"$f":"COUNTIFS('1. Data Sheet'!$F$6:$F$506,'3. Term Sheet'!$E$6,'1. Data Sheet'!$I$6:$I$506,A4)","v":0},{"$f":"COUNTIFS('1. Data Sheet'!$F$6:$F$506,'3. Term Sheet'!$E$7,'1. Data Sheet'!$I$6:$I$506,A4)","v":0},{"$f":"COUNTIFS('1. Data Sheet'!$F$6:$F$506,'3. Term Sheet'!$E$8,'1. Data Sheet'!$I$6:$I$506,A4)","v":0},null,3,{"$f":"COUNTIFS('1. Data Sheet'!$F$6:$F$506,'3. Term Sheet'!$E$4,'1. Data Sheet'!$K$6:$K$506,A4)","v":0},{"$f":"COUNTIFS('1. Data Sheet'!$F$6:$F$506,'3. Term Sheet'!$E$5,'1. Data Sheet'!$K$6:$K$506,A4)","v":0},{"$f":"COUNTIFS('1. Data Sheet'!$F$6:$F$506,'3. Term Sheet'!$E$6,'1. Data Sheet'!$K$6:$K$506,A4)","v":0},{"$f":"COUNTIFS('1. Data Sheet'!$F$6:$F$506,'3. Term Sheet'!$E$7,'1. Data Sheet'!$K$6:$K$506,A4)","v":0},{"$f":"COUNTIFS('1. Data Sheet'!$F$6:$F$506,'3. Term Sheet'!$E$8,'1. Data Sheet'!$K$6:$K$506,A4)","v":0}]
[4,{"$f":"COUNTIFS('1. Data Sheet'!$F$6:$F$506,'3. Term Sheet'!$E$4,'1. Data Sheet'!$I$6:$I$506,A5)","v":0},{"$f":"COUNTIFS('1. Data Sheet'!$F$6:$F$506,'3. Term Sheet'!$E$5,'1. Data Sheet'!$I$6:$I$506,A5)","v":0},{"$f":"COUNTIFS('1. Data Sheet'!$F$6:$F$506,'3. Term Sheet'!$E$6,'1. Data Sheet'!$I$6:$I$506,A5)","v":0},{"$f":"COUNTIFS('1. Data Sheet'!$F$6:$F$506,'3. Term Sheet'!$E$7,'1. Data Sheet'!$I$6:$I$506,A5)","v":0},{"$f":"COUNTIFS('1. Data Sheet'!$F$6:$F$506,'3. Term Sheet'!$E$8,'1. Data Sheet'!$I$6:$I$506,A5)","v":0},null,4,{"$f":"COUNTIFS('1. Data Sheet'!$F$6:$F$506,'3. Term Sheet'!$E$4,'1. Data Sheet'!$K$6:$K$506,A5)","v":0},{"$f":"COUNTIFS('1. Data Sheet'!$F$6:$F$506,'3. Term Sheet'!$E$5,'1. Data Sheet'!$K$6:$K$506,A5)","v":0},{"$f":"COUNTIFS('1. Data Sheet'!$F$6:$F$506,'3. Term Sheet'!$E$6,'1. Data Sheet'!$K$6:$K$506,A5)","v":0},{"$f":"COUNTIFS('1. Data Sheet'!$F$6:$F$506,'3. Term Sheet'!$E$7,'1. Data Sheet'!$K$6:$K$506,A5)","v":0},{"$f":"COUNTIFS('1. Data Sheet'!$F$6:$F$506,'3. Term Sheet'!$E$8,'1. Data Sheet'!$K$6:$K$506,A5)","v":0}]
[]
[{"$f":"'3. Term Sheet'!E4","v":"Woman"},{"$f":"SUM(B10:B13)","v":0},{"$f":"IF(B15=0,NA(),B15)","v":{"$error":"#N/A"}},null,null,null,null,{"$f":"'3. Term Sheet'!E4","v":"Woman"},{"$f":"SUM(I10:I13)","v":0},{"$f":"IF(I15=0,NA(),I15)","v":{"$error":"#N/A"}}]
[{"$f":"'3. Term Sheet'!E5","v":"Man"},{"$f":"SUM(C10:C13)","v":0},{"$f":"IF(B16=0,NA(),B16)","v":{"$error":"#N/A"}},null,null,null,null,{"$f":"'3. Term Sheet'!E5","v":"Man"},{"$f":"SUM(J10:J13)","v":0},{"$f":"IF(I16=0,NA(),I16)","v":{"$error":"#N/A"}}]
[{"$f":"'3. Term Sheet'!E6","v":"Nonbinary"},{"$f":"SUM(D10:D13)","v":0},{"$error":"#N/A"},null,null,null,null,{"$f":"'3. Term Sheet'!E6","v":"Nonbinary"},{"$f":"SUM(K10:K13)","v":0},{"$error":"#N/A"}]
[{"$f":"'3. Term Sheet'!E7","v":"Other"},{"$f":"SUM(E10:E13)","v":0},{"$error":"#N/A"},null,null,null,null,{"$f":"'3. Term Sheet'!E7","v":"Other"},{"$f":"SUM(L10:L13)","v":0},{"$error":"#N/A"}]
[{"$f":"'3. Term Sheet'!E8","v":"Prefers not to disclose"},{"$f":"SUM(F10:F13)","v":0},{"$error":"#N/A"},null,null,null,null,{"$f":"'3. Term Sheet'!E8","v":"Prefers not to disclose"},{"$f":"SUM(M10:M13)","v":0},{"$error":"#N/A"}]
[]
["Total Demographic Profile Per Current Individual Score",null,null,null,null,null,null,null,"Active Demographic Profile Per Current Manager Score"]
[null,{"$f":"'3. Term Sheet'!D4","v":"Asian"},{"$f":"'3. Term Sheet'!D5","v":"Black"},{"$f":"'3. Term Sheet'!D6","v":"Hispanic or Latino"},{"$f":"'3. Term Sheet'!D7","v":"White"},{"$f":"'3. Term Sheet'!D8","v":"American Indian/Alaska Native"},{"$f":"'3. Term Sheet'!D9","v":"Prefers not to identify"},null,null,{"$f":"'3. Term Sheet'!D4","v":"Asian"},{"$f":"'3. Term Sheet'!D5","v":"Black"},{"$f":"'3. Term Sheet'!D6","v":"Hispanic or Latino"},{"$f":"'3. Term Sheet'!D7","v":"White"},{"$f":"'3. Term Sheet'!D8","v":"American Indian/Alaska Native"},{"$f":"'3. Term Sheet'!D9","v":"Prefers not to identify"}]
[{"$f":"A2","v":1},{"$f":"COUNTIFS('1. Data Sheet'!$E$6:$E$506,'3. Term Sheet'!$D$4,'1. Data Sheet'!$I$6:$I$506,A2)","v":0},{"$f":"COUNTIFS('1. Data Sheet'!$E$6:$E$506,'3. Term Sheet'!$D$5,'1. Data Sheet'!$I$6:$I$506,A2)","v":0},{"$f":"COUNTIFS('1. Data Sheet'!$E$6:$E$506,'3. Term Sheet'!$D$6,'1. Data Sheet'!$I$6:$I$506,A2)","v":0},{"$f":"COUNTIFS('1. Data Sheet'!$E$6:$E$506,'3. Term Sheet'!$D$7,'1. Data Sheet'!$I$6:$I$506,A2)","v":0},{"$f":"COUNTIFS('1. Data Sheet'!$E$6:$E$506,'3. Term Sheet'!$D$8,'1. Data Sheet'!$I$6:$I$506,A2)","v":0},{"$f":"COUNTIFS('1. Data Sheet'!$E$6:$E$506,'3. Term Sheet'!$D$9,'1. Data Sheet'!$I$6:$I$506,A2)","v":0},null,{"$f":"A2","v":1},{"$f":"COUNTIFS('1. Data Sheet'!$E$6:$E$506,'3. Term Sheet'!$D$4,'1. Data Sheet'!$K$6:K$506,A2)","v":0},{"$f":"COUNTIFS('1. Data Sheet'!$E$6:$E$506,'3. Term Sheet'!$D$5,'1. Data Sheet'!$K$6:$K$506,A2)","v":0},{"$f":"COUNTIFS('1. Data Sheet'!$E$6:$E$506,'3. Term Sheet'!$D$6,'1. Data Sheet'!$K$6:$K$506,A2)","v":0},{"$f":"COUNTIFS('1. Data Sheet'!$E$6:$E$506,'3. Term Sheet'!$D$7,'1. Data Sheet'!$K$6:$K$506,A2)","v":0},{"$f":"COUNTIFS('1. Data Sheet'!$E$6:$E$506,'3. Term Sheet'!$D$8,'1. Data Sheet'!$K$6:$K$506,A2)","v":0},{"$f":"COUNTIFS('1. Data Sheet'!$E$6:$E$506,'3. Term Sheet'!$D$9,'1. Data Sheet'!$K$6:$K$506,A2)","v":0}]
[{"$f":"A3","v":2},{"$f":"COUNTIFS('1. Data Sheet'!$E$6:$E$506,'3. Term Sheet'!$D$4,'1. Data Sheet'!$I$6:$I$506,A3)","v":0},{"$f":"COUNTIFS('1. Data Sheet'!$E$6:$E$506,'3. Term Sheet'!$D$5,'1. Data Sheet'!$I$6:$I$506,A3)","v":0},{"$f":"COUNTIFS('1. Data Sheet'!$E$6:$E$506,'3. Term Sheet'!$D$6,'1. Data Sheet'!$I$6:$I$506,A3)","v":0},{"$f":"COUNTIFS('1. Data Sheet'!$E$6:$E$506,'3. Term Sheet'!$D$7,'1. Data Sheet'!$I$6:$I$506,A3)","v":0},{"$f":"COUNTIFS('1. Data Sheet'!$E$6:$E$506,'3. Term Sheet'!$D$8,'1. Data Sheet'!$I$6:$I$506,A3)","v":0},{"$f":"COUNTIFS('1. Data Sheet'!$E$6:$E$506,'3. Term Sheet'!$D$9,'1. Data Sheet'!$I$6:$I$506,A3)","v":0},null,{"$f":"A3","v":2},{"$f":"COUNTIFS('1. Data Sheet'!$E$6:$E$506,'3. Term Sheet'!$D$4,'1. Data Sheet'!$K$6:K$506,A3)","v":0},{"$f":"COUNTIFS('1. Data Sheet'!$E$6:$E$506,'3. Term Sheet'!$D$5,'1. Data Sheet'!$K$6:$K$506,A3)","v":0},{"$f":"COUNTIFS('1. Data Sheet'!$E$6:$E$506,'3. Term Sheet'!$D$6,'1. Data Sheet'!$K$6:$K$506,A3)","v":0},{"$f":"COUNTIFS('1. Data Sheet'!$E$6:$E$506,'3. Term Sheet'!$D$7,'1. Data Sheet'!$K$6:$K$506,A3)","v":0},{"$f":"COUNTIFS('1. Data Sheet'!$E$6:$E$506,'3. Term Sheet'!$D$8,'1. Data Sheet'!$K$6:$K$506,A3)","v":0},{"$f":"COUNTIFS('1. Data Sheet'!$E$6:$E$506,'3. Term Sheet'!$D$9,'1. Data Sheet'!$K$6:$K$506,A3)","v":0}]
[3,{"$f":"COUNTIFS('1. Data Sheet'!$E$6:$E$506,'3. Term Sheet'!$D$4,'1. Data Sheet'!$I$6:$I$506,A4)","v":0},{"$f":"COUNTIFS('1. Data Sheet'!$E$6:$E$506,'3. Term Sheet'!$D$5,'1. Data Sheet'!$I$6:$I$506,A4)","v":0},{"$f":"COUNTIFS('1. Data Sheet'!$E$6:$E$506,'3. Term Sheet'!$D$6,'1. Data Sheet'!$I$6:$I$506,A4)","v":0},{"$f":"COUNTIFS('1. Data Sheet'!$E$6:$E$506,'3. Term Sheet'!$D$7,'1. Data Sheet'!$I$6:$I$506,A4)","v":0},{"$f":"COUNTIFS('1. Data Sheet'!$E$6:$E$506,'3. Term Sheet'!$D$8,'1. Data Sheet'!$I$6:$I$506,A4)","v":0},{"$f":"COUNTIFS('1. Data Sheet'!$E$6:$E$506,'3. Term Sheet'!$D$9,'1. Data Sheet'!$I$6:$I$506,A4)","v":0},null,3,{"$f":"COUNTIFS('1. Data Sheet'!$E$6:$E$506,'3. Term Sheet'!$D$4,'1. Data Sheet'!$K$6:K$506,A4)","v":0},{"$f":"COUNTIFS('1. Data Sheet'!$E$6:$E$506,'3. Term Sheet'!$D$5,'1. Data Sheet'!$K$6:$K$506,A4)","v":0},{"$f":"COUNTIFS('1. Data Sheet'!$E$6:$E$506,'3. Term Sheet'!$D$6,'1. Data Sheet'!$K$6:$K$506,A4)","v":0},{"$f":"COUNTIFS('1. Data Sheet'!$E$6:$E$506,'3. Term Sheet'!$D$7,'1. Data Sheet'!$K$6:$K$506,A4)","v":0},{"$f":"COUNTIFS('1. Data Sheet'!$E$6:$E$506,'3. Term Sheet'!$D$8,'1. Data Sheet'!$K$6:$K$506,A4)","v":0},{"$f":"COUNTIFS('1. Data Sheet'!$E$6:$E$506,'3. Term Sheet'!$D$9,'1. Data Sheet'!$K$6:$K$506,A4)","v":0}]
[4,{"$f":"COUNTIFS('1. Data Sheet'!$E$6:$E$506,'3. Term Sheet'!$D$4,'1. Data Sheet'!$I$6:$I$506,A5)","v":0},{"$f":"COUNTIFS('1. Data Sheet'!$E$6:$E$506,'3. Term Sheet'!$D$5,'1. Data Sheet'!$I$6:$I$506,A5)","v":0},{"$f":"COUNTIFS('1. Data Sheet'!$E$6:$E$506,'3. Term Sheet'!$D$6,'1. Data Sheet'!$I$6:$I$506,A5)","v":0},{"$f":"COUNTIFS('1. Data Sheet'!$E$6:$E$506,'3. Term Sheet'!$D$7,'1. Data Sheet'!$I$6:$I$506,A5)","v":0},{"$f":"COUNTIFS('1. Data Sheet'!$E$6:$E$506,'3. Term Sheet'!$D$8,'1. Data Sheet'!$I$6:$I$506,A5)","v":0},{"$f":"COUNTIFS('1. Data Sheet'!$E$6:$E$506,'3. Term Sheet'!$D$9,'1. Data Sheet'!$I$6:$I$506,A5)","v":0},null,4,{"$f":"COUNTIFS('1. Data Sheet'!$E$6:$E$506,'3. Term Sheet'!$D$4,'1. Data Sheet'!$K$6:K$506,A5)","v":0},{"$f":"COUNTIFS('1. Data Sheet'!$E$6:$E$506,'3. Term Sheet'!$D$5,'1. Data Sheet'!$K$6:$K$506,A5)","v":0},{"$f":"COUNTIFS('1. Data Sheet'!$E$6:$E$506,'3. Term Sheet'!$D$6,'1. Data Sheet'!$K$6:$K$506,A5)","v":0},{"$f":"COUNTIFS('1. Data Sheet'!$E$6:$E$506,'3. Term Sheet'!$D$7,'1. Data Sheet'!$K$6:$K$506,A5)","v":0},{"$f":"COUNTIFS('1. Data Sheet'!$E$6:$E$506,'3. Term Sheet'!$D$8,'1. Data Sheet'!$K$6:$K$506,A5)","v":0},{"$f":"COUNTIFS('1. Data Sheet'!$E$6:$E$506,'3. Term Sheet'!$D$9,'1. Data Sheet'!$K$6:$K$506,A5)","v":0}]
[]
[{"$f":"'3. Term Sheet'!D4","v":"Asian"},{"$f":"SUM(B23:B26)","v":0},{"$f":"IF(B28=0,NA(),B28)","v":{"$error":"#N/A"}},null,null,null,null,null,{"$f":"'3. Term Sheet'!D4","v":"Asian"},{"$f":"SUM(J23:J26)","v":0},{"$f":"IF(J28=0,NA(),J28)","v":{"$error":"#N/A"}}]
[{"$f":"'3. Term Sheet'!D5","v":"Black"},{"$f":"SUM(C23:C26)","v":0},{"$f":"IF(B29=0,NA(),B29)","v":{"$error":"#N/A"}},null,null,null,null,null,{"$f":"'3. Term Sheet'!D5","v":"Black"},{"$f":"SUM(K23:K26)","v":0},{"$f":"IF(J29=0,NA(),J29)","v":{"$error":"#N/A"}}]
[{"$f":"'3. Term Sheet'!D6","v":"Hispanic or Latino"},{"$f":"SUM(D23:D26)","v":0},{"$error":"#N/A"},null,null,null,null,null,{"$f":"'3. Term Sheet'!D6","v":"Hispanic or Latino"},{"$f":"SUM(L23:L26)","v":0},{"$error":"#N/A"}]
[{"$f":"'3. Term Sheet'!D7","v":"White"},{"$f":"SUM(E23:E26)","v":0},{"$error":"#N/A"},null,null,null,null,null,{"$f":"'3. Term Sheet'!D7","v":"White"},{"$f":"SUM(M23:M26)","v":0},{"$error":"#N/A"}]
[{"$f":"'3. Term Sheet'!D8","v":"American Indian/Alaska Native"},{"$f":"SUM(F23:F26)","v":0},{"$error":"#N/A"},null,null,null,null,null,{"$f":"'3. Term Sheet'!D8","v":"American Indian/Alaska Native"},{"$f":"SUM(N23:N26)","v":0},{"$error":"#N/A"}]
[{"$f":"'3. Term Sheet'!D9","v":"Prefers not to identify"},{"$f":"SUM(G23:G26)","v":0},{"$error":"#N/A"},null,null,null,null,null,{"$f":"'3. Term Sheet'!D9","v":"Prefers not to identify"},{"$f":"SUM(O23:O26)","v":0},{"$error":"#N/A"}]
[]
["Total Age Profile Per Current Individual Score",null,null,null,null,null,null,null,"Active Age Profile Per Current Manager Score"]
[null,{"$f":"'3. Term Sheet'!C4","v":"18–24"},{"$f":"'3. Term Sheet'!C5","v":"25–34"},{"$f":"'3. Term Sheet'!C6","v":"35–44"},{"$f":"'3. Term Sheet'!C7","v":"45–54"},{"$f":"'3. Term Sheet'!C8","v":"55–64"},{"$f":"'3. Term Sheet'!C9","v":"65+"},null,null,{"$f":"'3. Term Sheet'!C4","v":"18–24"},{"$f":"'3. Term Sheet'!C5","v":"25–34"},{"$f":"'3. Term Sheet'!C6","v":"35–44"},{"$f":"'3. Term Sheet'!C7","v":"45–54"},{"$f":"'3. Term Sheet'!C8","v":"55–64"},{"$f":"'3. Term Sheet'!C9","v":"65+"}]
[{"$f":"A10","v":1},{"$f":"COUNTIFS('1. Data Sheet'!$D$6:$D$506,'3. Term Sheet'!$C$4,'1. Data Sheet'!$I$6:$I$506,A2)","v":0},{"$f":"COUNTIFS('1. Data Sheet'!$D$6:$D$506,'3. Term Sheet'!$C$5,'1. Data Sheet'!$I$6:$I$506,A2)","v":0},{"$f":"COUNTIFS('1. Data Sheet'!$D$6:$D$506,'3. Term Sheet'!$C$6,'1. Data Sheet'!$I$6:$I$506,A2)","v":0},{"$f":"COUNTIFS('1. Data Sheet'!$D$6:$D$506,'3. Term Sheet'!$C$7,'1. Data Sheet'!$I$6:$I$506,A2)","v":0},{"$f":"COUNTIFS('1. Data Sheet'!$D$6:$D$506,'3. Term Sheet'!$C$8,'1. Data Sheet'!$I$6:$I$506,A2)","v":0},{"$f":"COUNTIFS('1. Data Sheet'!$D$6:$D$506,'3. Term Sheet'!$C$9,'1. Data Sheet'!$I$6:$I$506,A2)","v":0},null,{"$f":"A10","v":1},{"$f":"COUNTIFS('1. Data Sheet'!$D$6:$D$506,'3. Term Sheet'!$C$4,'1. Data Sheet'!$K$6:$K$506,A2)","v":0},{"$f":"COUNTIFS('1. Data Sheet'!$D$6:$D$506,'3. Term Sheet'!$C$5,'1. Data Sheet'!$K$6:$K$506,A2)","v":0},{"$f":"COUNTIFS('1. Data Sheet'!$D$6:$D$506,'3. Term Sheet'!$C$6,'1. Data Sheet'!$K$6:$K$506,A2)","v":0},{"$f":"COUNTIFS('1. Data Sheet'!$D$6:$D$506,'3. Term Sheet'!$C$7,'1. Data Sheet'!$K$6:$K$506,A2)","v":0},{"$f":"COUNTIFS('1. Data Sheet'!$D$6:$D$506,'3. Term Sheet'!$C$8,'1. Data Sheet'!$K$6:$K$506,A2)","v":0},{"$f":"COUNTIFS('1. Data Sheet'!$D$6:$D$506,'3. Term Sheet'!$C$9,'1. Data Sheet'!$K$6:$K$506,A2)","v":0}]
[{"$f":"A11","v":2},{"$f":"COUNTIFS('1. Data Sheet'!$D$6:$D$506,'3. Term Sheet'!$C$4,'1. Data Sheet'!$I$6:$I$506,A3)","v":0},{"$f":"COUNTIFS('1. Data Sheet'!$D$6:$D$506,'3. Term Sheet'!$C$5,'1. Data Sheet'!$I$6:$I$506,A3)","v":0},{"$f":"COUNTIFS('1. Data Sheet'!$D$6:$D$506,'3. Term Sheet'!$C$6,'1. Data Sheet'!$I$6:$I$506,A3)","v":0},{"$f":"COUNTIFS('1. Data Sheet'!$D$6:$D$506,'3. Term Sheet'!$C$7,'1. Data Sheet'!$I$6:$I$506,A3)","v":0},{"$f":"COUNTIFS('1. Data Sheet'!$D$6:$D$506,'3. Term Sheet'!$C$8,'1. Data Sheet'!$I$6:$I$506,A3)","v":0},{"$f":"COUNTIFS('1. Data Sheet'!$D$6:$D$506,'3. Term Sheet'!$C$9,'1. Data Sheet'!$I$6:$I$506,A3)","v":0},null,{"$f":"A11","v":2},{"$f":"COUNTIFS('1. Data Sheet'!$D$6:$D$506,'3. Term Sheet'!$C$4,'1. Data Sheet'!$K$6:$K$506,A3)","v":0},{"$f":"COUNTIFS('1. Data Sheet'!$D$6:$D$506,'3. Term Sheet'!$C$5,'1. Data Sheet'!$K$6:$K$506,A3)","v":0},{"$f":"COUNTIFS('1. Data Sheet'!$D$6:$D$506,'3. Term Sheet'!$C$6,'1. Data Sheet'!$K$6:$K$506,A3)","v":0},{"$f":"COUNTIFS('1. Data Sheet'!$D$6:$D$506,'3. Term Sheet'!$C$7,'1. Data Sheet'!$K$6:$K$506,A3)","v":0},{"$f":"COUNTIFS('1. Data Sheet'!$D$6:$D$506,'3. Term Sheet'!$C$8,'1. Data Sheet'!$K$6:$K$506,A3)","v":0},{"$f":"COUNTIFS('1. Data Sheet'!$D$6:$D$506,'3. Term Sheet'!$C$9,'1. Data Sheet'!$K$6:$K$506,A3)","v":0}]
[3,{"$f":"COUNTIFS('1. Data Sheet'!$D$6:$D$506,'3. Term Sheet'!$C$4,'1. Data Sheet'!$I$6:$I$506,A4)","v":0},{"$f":"COUNTIFS('1. Data Sheet'!$D$6:$D$506,'3. Term Sheet'!$C$5,'1. Data Sheet'!$I$6:$I$506,A4)","v":0},{"$f":"COUNTIFS('1. Data Sheet'!$D$6:$D$506,'3. Term Sheet'!$C$6,'1. Data Sheet'!$I$6:$I$506,A4)","v":0},{"$f":"COUNTIFS('1. Data Sheet'!$D$6:$D$506,'3. Term Sheet'!$C$7,'1. Data Sheet'!$I$6:$I$506,A4)","v":0},{"$f":"COUNTIFS('1. Data Sheet'!$D$6:$D$506,'3. Term Sheet'!$C$8,'1. Data Sheet'!$I$6:$I$506,A4)","v":0},{"$f":"COUNTIFS('1. Data Sheet'!$D$6:$D$506,'3. Term Sheet'!$C$9,'1. Data Sheet'!$I$6:$I$506,A4)","v":0},null,3,{"$f":"COUNTIFS('1. Data Sheet'!$D$6:$D$506,'3. Term Sheet'!$C$4,'1. Data Sheet'!$K$6:$K$506,A4)","v":0},{"$f":"COUNTIFS('1. Data Sheet'!$D$6:$D$506,'3. Term Sheet'!$C$5,'1. Data Sheet'!$K$6:$K$506,A4)","v":0},{"$f":"COUNTIFS('1. Data Sheet'!$D$6:$D$506,'3. Term Sheet'!$C$6,'1. Data Sheet'!$K$6:$K$506,A4)","v":0},{"$f":"COUNTIFS('1. Data Sheet'!$D$6:$D$506,'3. Term Sheet'!$C$7,'1. Data Sheet'!$K$6:$K$506,A4)","v":0},{"$f":"COUNTIFS('1. Data Sheet'!$D$6:$D$506,'3. Term Sheet'!$C$8,'1. Data Sheet'!$K$6:$K$506,A4)","v":0},{"$f":"COUNTIFS('1. Data Sheet'!$D$6:$D$506,'3. Term Sheet'!$C$9,'1. Data Sheet'!$K$6:$K$506,A4)","v":0}]
[4,{"$f":"COUNTIFS('1. Data Sheet'!$D$6:$D$506,'3. Term Sheet'!$C$4,'1. Data Sheet'!$I$6:$I$506,A5)","v":0},{"$f":"COUNTIFS('1. Data Sheet'!$D$6:$D$506,'3. Term Sheet'!$C$5,'1. Data Sheet'!$I$6:$I$506,A5)","v":0},{"$f":"COUNTIFS('1. Data Sheet'!$D$6:$D$506,'3. Term Sheet'!$C$6,'1. Data Sheet'!$I$6:$I$506,A5)","v":0},{"$f":"COUNTIFS('1. Data Sheet'!$D$6:$D$506,'3. Term Sheet'!$C$7,'1. Data Sheet'!$I$6:$I$506,A5)","v":0},{"$f":"COUNTIFS('1. Data Sheet'!$D$6:$D$506,'3. Term Sheet'!$C$8,'1. Data Sheet'!$I$6:$I$506,A5)","v":0},{"$f":"COUNTIFS('1. Data Sheet'!$D$6:$D$506,'3. Term Sheet'!$C$9,'1. Data Sheet'!$I$6:$I$506,A5)","v":0},null,4,{"$f":"COUNTIFS('1. Data Sheet'!$D$6:$D$506,'3. Term Sheet'!$C$4,'1. Data Sheet'!$K$6:$K$506,A5)","v":0},{"$f":"COUNTIFS('1. Data Sheet'!$D$6:$D$506,'3. Term Sheet'!$C$5,'1. Data Sheet'!$K$6:$K$506,A5)","v":0},{"$f":"COUNTIFS('1. Data Sheet'!$D$6:$D$506,'3. Term Sheet'!$C$6,'1. Data Sheet'!$K$6:$K$506,A5)","v":0},{"$f":"COUNTIFS('1. Data Sheet'!$D$6:$D$506,'3. Term Sheet'!$C$7,'1. Data Sheet'!$K$6:$K$506,A5)","v":0},{"$f":"COUNTIFS('1. Data Sheet'!$D$6:$D$506,'3. Term Sheet'!$C$8,'1. Data Sheet'!$K$6:$K$506,A5)","v":0},{"$f":"COUNTIFS('1. Data Sheet'!$D$6:$D$506,'3. Term Sheet'!$C$9,'1. Data Sheet'!$K$6:$K$506,A5)","v":0}]
{"$rows_left_out":133}